===== language-bindings-ubuntu-c-cpp.txt =====
# Azul language-binding AZ_E2E status board
Host: Linux | lib: /home/runner/work/azul/azul/target/release/libazul.so
Scenario: /home/runner/work/azul/azul/tests/e2e/hello_world_counter.json
Logs: /tmp/azul-e2e-matrix.BHzT4j
| language | tier | status | note |
|----------|------|--------|------|
| c | shipped | ✓ WORKS | test result: ok |
| cpp | shipped | ✓ WORKS | test result: ok |
Tally: 2 ✓ WORKS / 0 ✗ FAILS / 0 ⊘ SKIP (of 2 languages); SHIPPED failures: 0
===== language-bindings-ubuntu-rust.txt =====
# Azul language-binding AZ_E2E status board
Host: Linux | lib: /home/runner/work/azul/azul/target/release/libazul.so
Scenario: /home/runner/work/azul/azul/tests/e2e/hello_world_counter.json
Logs: /tmp/azul-e2e-matrix.bKumNI
| language | tier | status | note |
|----------|------|--------|------|
| rust | shipped | ✓ WORKS | test result: ok |
Tally: 1 ✓ WORKS / 0 ✗ FAILS / 0 ⊘ SKIP (of 1 languages); SHIPPED failures: 0
===== language-bindings-ubuntu-scripting-a.txt =====
# Azul language-binding AZ_E2E status board
Host: Linux | lib: /home/runner/work/azul/azul/target/release/libazul.so
Scenario: /home/runner/work/azul/azul/tests/e2e/hello_world_counter.json
Logs: /tmp/azul-e2e-matrix.mjQ8x3
| language | tier | status | note |
|----------|------|--------|------|
| haskell | shipped | ✓ WORKS | test result: ok |
| kotlin | shipped | ✓ WORKS | test result: ok |
| java | shipped | ✓ WORKS | test result: ok |
| scala | shipped | ✓ WORKS | test result: ok |
| csharp | shipped | ✓ WORKS | test result: ok |
| ocaml | shipped | ✓ WORKS | test result: ok |
Tally: 6 ✓ WORKS / 0 ✗ FAILS / 0 ⊘ SKIP (of 6 languages); SHIPPED failures: 0
===== language-bindings-ubuntu-scripting-b.txt =====
Reading package lists...
Building dependency tree...
Reading state information...
The following additional packages will be installed:
libluajit-5.1-2 libluajit-5.1-common
The following NEW packages will be installed:
libluajit-5.1-2 libluajit-5.1-common luajit
0 upgraded, 3 newly installed, 0 to remove and 79 not upgraded.
Need to get 565 kB of archives.
After this operation, 1355 kB of additional disk space will be used.
Get:1 file:/etc/apt/apt-mirrors.txt Mirrorlist [144 B]
Get:2 http://azure.archive.ubuntu.com/ubuntu jammy-updates/universe amd64 libluajit-5.1-common all 2.1.0~beta3+dfsg-6ubuntu0.1 [46.6 kB]
Get:3 http://azure.archive.ubuntu.com/ubuntu jammy-updates/universe amd64 libluajit-5.1-2 amd64 2.1.0~beta3+dfsg-6ubuntu0.1 [256 kB]
Get:4 http://azure.archive.ubuntu.com/ubuntu jammy-updates/universe amd64 luajit amd64 2.1.0~beta3+dfsg-6ubuntu0.1 [263 kB]
Fetched 565 kB in 0s (2827 kB/s)
Selecting previously unselected package libluajit-5.1-common.
(Reading database ...
(Reading database ... 5%
(Reading database ... 10%
(Reading database ... 15%
(Reading database ... 20%
(Reading database ... 25%
(Reading database ... 30%
(Reading database ... 35%
(Reading database ... 40%
(Reading database ... 45%
(Reading database ... 50%
(Reading database ... 55%
(Reading database ... 60%
(Reading database ... 65%
(Reading database ... 70%
(Reading database ... 75%
(Reading database ... 80%
(Reading database ... 85%
(Reading database ... 90%
(Reading database ... 95%
(Reading database ... 100%
(Reading database ... 263138 files and directories currently installed.)
Preparing to unpack .../libluajit-5.1-common_2.1.0~beta3+dfsg-6ubuntu0.1_all.deb ...
Unpacking libluajit-5.1-common (2.1.0~beta3+dfsg-6ubuntu0.1) ...
Selecting previously unselected package libluajit-5.1-2:amd64.
Preparing to unpack .../libluajit-5.1-2_2.1.0~beta3+dfsg-6ubuntu0.1_amd64.deb ...
Unpacking libluajit-5.1-2:amd64 (2.1.0~beta3+dfsg-6ubuntu0.1) ...
Selecting previously unselected package luajit.
Preparing to unpack .../luajit_2.1.0~beta3+dfsg-6ubuntu0.1_amd64.deb ...
Unpacking luajit (2.1.0~beta3+dfsg-6ubuntu0.1) ...
Setting up libluajit-5.1-common (2.1.0~beta3+dfsg-6ubuntu0.1) ...
Setting up libluajit-5.1-2:amd64 (2.1.0~beta3+dfsg-6ubuntu0.1) ...
Setting up luajit (2.1.0~beta3+dfsg-6ubuntu0.1) ...
Processing triggers for man-db (2.10.2-1) ...
Not building database; man-db/auto-update is not 'true'.
Processing triggers for libc-bin (2.35-0ubuntu3.14) ...
Running kernel seems to be up-to-date.
Services to be restarted:
systemctl restart chrony.service
systemctl restart containerd.service
systemctl restart cron.service
systemctl restart haveged.service
systemctl restart hv-kvp-daemon.service
systemctl restart irqbalance.service
systemctl restart mono-xsp4.service
systemctl restart multipathd.service
systemctl restart packagekit.service
systemctl restart php8.1-fpm.service
systemctl restart polkit.service
systemctl restart rsyslog.service
systemctl restart serial-getty@ttyS0.service
systemctl restart snapd.service
systemctl restart ssh.service
systemctl restart systemd-journald.service
systemctl restart systemd-networkd.service
systemctl restart systemd-resolved.service
systemctl restart systemd-udevd.service
Service restarts being deferred:
/etc/needrestart/restart.d/dbus.service
systemctl restart docker.service
systemctl restart getty@tty1.service
systemctl restart hosted-compute-agent.service
systemctl restart networkd-dispatcher.service
systemctl restart systemd-logind.service
systemctl restart user@1001.service
systemctl restart walinuxagent.service
No containers need to be restarted.
No user sessions are running outdated binaries.
No VM guests are running outdated hypervisor (qemu) binaries on this host.
Reading package lists...
Building dependency tree...
Reading state information...
The following packages will be REMOVED:
luajit
0 upgraded, 0 newly installed, 1 to remove and 79 not upgraded.
After this operation, 580 kB disk space will be freed.
(Reading database ...
(Reading database ... 5%
(Reading database ... 10%
(Reading database ... 15%
(Reading database ... 20%
(Reading database ... 25%
(Reading database ... 30%
(Reading database ... 35%
(Reading database ... 40%
(Reading database ... 45%
(Reading database ... 50%
(Reading database ... 55%
(Reading database ... 60%
(Reading database ... 65%
(Reading database ... 70%
(Reading database ... 75%
(Reading database ... 80%
(Reading database ... 85%
(Reading database ... 90%
(Reading database ... 95%
(Reading database ... 100%
(Reading database ... 263169 files and directories currently installed.)
Removing luajit (2.1.0~beta3+dfsg-6ubuntu0.1) ...
Processing triggers for man-db (2.10.2-1) ...
Not building database; man-db/auto-update is not 'true'.
Reading package lists...
Building dependency tree...
Reading state information...
The following packages will be REMOVED:
apport-symptoms bc landscape-common libintl-perl libintl-xs-perl libisns0
liblldb-13 liblldb-15 libluajit-5.1-2 libluajit-5.1-common
libmodule-find-perl libmodule-scandeps-perl libmspack0 libopeniscsiusr
libproc-processtable-perl libsort-naturally-perl libterm-readkey-perl
libxmlsec1 libxmlsec1-openssl lxd-agent-loader needrestart open-iscsi
open-vm-tools python3-apport python3-automat python3-bcrypt python3-click
python3-colorama python3-constantly python3-hamcrest python3-hyperlink
python3-incremental python3-problem-report python3-pyasn1
python3-pyasn1-modules python3-service-identity python3-systemd
python3-twisted python3-zope.interface zerofree
0 upgraded, 0 newly installed, 40 to remove and 79 not upgraded.
After this operation, 63.7 MB disk space will be freed.
(Reading database ...
(Reading database ... 5%
(Reading database ... 10%
(Reading database ... 15%
(Reading database ... 20%
(Reading database ... 25%
(Reading database ... 30%
(Reading database ... 35%
(Reading database ... 40%
(Reading database ... 45%
(Reading database ... 50%
(Reading database ... 55%
(Reading database ... 60%
(Reading database ... 65%
(Reading database ... 70%
(Reading database ... 75%
(Reading database ... 80%
(Reading database ... 85%
(Reading database ... 90%
(Reading database ... 95%
(Reading database ... 100%
(Reading database ... 263164 files and directories currently installed.)
Removing apport-symptoms (0.24) ...
Removing landscape-common (23.02-0ubuntu1~22.04.7) ...
Removing bc (1.07.1-3build1) ...
Removing libintl-xs-perl (1.26-3build2) ...
Removing needrestart (3.5-5ubuntu2.5) ...
Removing libintl-perl (1.26-3build2) ...
Removing open-iscsi (2.1.5-1ubuntu1.1) ...
Warning: Stopping iscsid.service, but it can still be activated by:
iscsid.socket
Removing libisns0:amd64 (0.101-0ubuntu2) ...
Removing liblldb-13 (1:13.0.1-2ubuntu2.2) ...
Removing liblldb-15 (1:15.0.7-0ubuntu0.22.04.3) ...
Removing libluajit-5.1-2:amd64 (2.1.0~beta3+dfsg-6ubuntu0.1) ...
Removing libluajit-5.1-common (2.1.0~beta3+dfsg-6ubuntu0.1) ...
Removing libmodule-find-perl (0.15-1) ...
Removing libmodule-scandeps-perl (1.31-1ubuntu0.1) ...
Removing open-vm-tools (2:12.3.5-3~ubuntu0.22.04.3) ...
Removing libmspack0:amd64 (0.10.1-2build2) ...
Removing libopeniscsiusr (2.1.5-1ubuntu1.1) ...
Removing libproc-processtable-perl:amd64 (0.634-1build1) ...
Removing libsort-naturally-perl (1.03-2) ...
Removing libterm-readkey-perl (2.38-1build4) ...
Removing libxmlsec1-openssl:amd64 (1.2.33-1build2) ...
Removing libxmlsec1:amd64 (1.2.33-1build2) ...
Removing lxd-agent-loader (0.5) ...
Removing python3-apport (2.20.11-0ubuntu82.10) ...
Removing python3-twisted (22.1.0-2ubuntu2.7) ...
Removing python3-automat (20.2.0-1) ...
Removing python3-bcrypt (3.2.0-1build1) ...
Removing python3-click (8.0.3-1) ...
Removing python3-colorama (0.4.4-1) ...
Removing python3-constantly (15.1.0-2) ...
Removing python3-hamcrest (2.0.2-2) ...
Removing python3-hyperlink (21.0.0-3) ...
Removing python3-incremental (21.3.0-1) ...
Removing python3-problem-report (2.20.11-0ubuntu82.10) ...
Removing python3-service-identity (18.1.0-6) ...
Removing python3-pyasn1-modules (0.2.1-1) ...
Removing python3-pyasn1 (0.4.8-1ubuntu0.3) ...
Removing python3-systemd (234-3ubuntu2) ...
Removing python3-zope.interface (5.4.0-1build1) ...
Removing zerofree (1.1.1-1build3) ...
Processing triggers for libc-bin (2.35-0ubuntu3.14) ...
Processing triggers for man-db (2.10.2-1) ...
Not building database; man-db/auto-update is not 'true'.
Processing triggers for install-info (6.8-4build1) ...
Processing triggers for initramfs-tools (0.140ubuntu13.5) ...
update-initramfs: Generating /boot/initrd.img-6.8.0-1064-azure
Successfully installed ffi-1.17.4-x86_64-linux-gnu
1 gem installed
Reading package lists...
Building dependency tree...
Reading state information...
The following additional packages will be installed:
fp-compiler-3.2.2 fp-units-rtl-3.2.2
Suggested packages:
fp-docs-3.2.2
Recommended packages:
fp-utils-3.2.2
The following NEW packages will be installed:
fp-compiler fp-compiler-3.2.2 fp-units-rtl-3.2.2
0 upgraded, 3 newly installed, 0 to remove and 79 not upgraded.
Need to get 10.3 MB of archives.
After this operation, 64.4 MB of additional disk space will be used.
Get:1 file:/etc/apt/apt-mirrors.txt Mirrorlist [144 B]
Get:2 http://azure.archive.ubuntu.com/ubuntu jammy/universe amd64 fp-units-rtl-3.2.2 amd64 3.2.2+dfsg-9ubuntu1 [7930 kB]
Get:3 http://azure.archive.ubuntu.com/ubuntu jammy/universe amd64 fp-compiler-3.2.2 amd64 3.2.2+dfsg-9ubuntu1 [2357 kB]
Get:4 http://azure.archive.ubuntu.com/ubuntu jammy/universe amd64 fp-compiler amd64 3.2.2+dfsg-9ubuntu1 [24.3 kB]
Preconfiguring packages ...
Fetched 10.3 MB in 1s (15.8 MB/s)
Selecting previously unselected package fp-units-rtl-3.2.2:amd64.
(Reading database ...
(Reading database ... 5%
(Reading database ... 10%
(Reading database ... 15%
(Reading database ... 20%
(Reading database ... 25%
(Reading database ... 30%
(Reading database ... 35%
(Reading database ... 40%
(Reading database ... 45%
(Reading database ... 50%
(Reading database ... 55%
(Reading database ... 60%
(Reading database ... 65%
(Reading database ... 70%
(Reading database ... 75%
(Reading database ... 80%
(Reading database ... 85%
(Reading database ... 90%
(Reading database ... 95%
(Reading database ... 100%
(Reading database ... 260975 files and directories currently installed.)
Preparing to unpack .../fp-units-rtl-3.2.2_3.2.2+dfsg-9ubuntu1_amd64.deb ...
Unpacking fp-units-rtl-3.2.2:amd64 (3.2.2+dfsg-9ubuntu1) ...
Selecting previously unselected package fp-compiler-3.2.2:amd64.
Preparing to unpack .../fp-compiler-3.2.2_3.2.2+dfsg-9ubuntu1_amd64.deb ...
Unpacking fp-compiler-3.2.2:amd64 (3.2.2+dfsg-9ubuntu1) ...
Selecting previously unselected package fp-compiler:amd64.
Preparing to unpack .../fp-compiler_3.2.2+dfsg-9ubuntu1_amd64.deb ...
Unpacking fp-compiler:amd64 (3.2.2+dfsg-9ubuntu1) ...
Setting up fp-units-rtl-3.2.2:amd64 (3.2.2+dfsg-9ubuntu1) ...
Setting up fp-compiler-3.2.2:amd64 (3.2.2+dfsg-9ubuntu1) ...
update-alternatives: using /usr/bin/x86_64-linux-gnu-fpc-3.2.2 to provide /usr/bin/fpc (fpc) in auto mode
update-alternatives: using /etc/fpc-3.2.2.cfg to provide /etc/fpc.cfg (fpc.cfg) in auto mode
update-alternatives: using /usr/bin/fpc to provide /usr/bin/pc (pc) in auto mode
Setting up fp-compiler:amd64 (3.2.2+dfsg-9ubuntu1) ...
Processing triggers for man-db (2.10.2-1) ...
Not building database; man-db/auto-update is not 'true'.
Reading package lists...
Building dependency tree...
Reading state information...
The following packages will be REMOVED:
fp-compiler
0 upgraded, 0 newly installed, 1 to remove and 79 not upgraded.
After this operation, 124 kB disk space will be freed.
(Reading database ...
(Reading database ... 5%
(Reading database ... 10%
(Reading database ... 15%
(Reading database ... 20%
(Reading database ... 25%
(Reading database ... 30%
(Reading database ... 35%
(Reading database ... 40%
(Reading database ... 45%
(Reading database ... 50%
(Reading database ... 55%
(Reading database ... 60%
(Reading database ... 65%
(Reading database ... 70%
(Reading database ... 75%
(Reading database ... 80%
(Reading database ... 85%
(Reading database ... 90%
(Reading database ... 95%
(Reading database ... 100%
(Reading database ... 261478 files and directories currently installed.)
Removing fp-compiler:amd64 (3.2.2+dfsg-9ubuntu1) ...
Reading package lists...
Building dependency tree...
Reading state information...
The following packages will be REMOVED:
fp-compiler-3.2.2 fp-units-rtl-3.2.2
0 upgraded, 0 newly installed, 2 to remove and 79 not upgraded.
After this operation, 64.3 MB disk space will be freed.
(Reading database ...
(Reading database ... 5%
(Reading database ... 10%
(Reading database ... 15%
(Reading database ... 20%
(Reading database ... 25%
(Reading database ... 30%
(Reading database ... 35%
(Reading database ... 40%
(Reading database ... 45%
(Reading database ... 50%
(Reading database ... 55%
(Reading database ... 60%
(Reading database ... 65%
(Reading database ... 70%
(Reading database ... 75%
(Reading database ... 80%
(Reading database ... 85%
(Reading database ... 90%
(Reading database ... 95%
(Reading database ... 100%
(Reading database ... 261475 files and directories currently installed.)
Removing fp-compiler-3.2.2:amd64 (3.2.2+dfsg-9ubuntu1) ...
update-alternatives: warning: alternative /usr/bin/fpc (part of link group pc) doesn't exist; removing from list of alternatives
update-alternatives: warning: /etc/alternatives/pc is dangling; it will be updated with best choice
Removing fp-units-rtl-3.2.2:amd64 (3.2.2+dfsg-9ubuntu1) ...
Processing triggers for man-db (2.10.2-1) ...
Not building database; man-db/auto-update is not 'true'.
!
! Can't write to /usr/local/share/perl/5.34.0 and /usr/local/bin: Installing modules to /home/runner/perl5
! To turn off this warning, you have to do one of the following:
! - run me as a root or with --sudo option (to install to /usr/local/share/perl/5.34.0 and /usr/local/bin)
! - Configure local::lib in your existing shell to set PERL_MM_OPT etc.
! - Install local::lib by running the following commands
!
! cpanm --local-lib=~/perl5 local::lib && eval $(perl -I ~/perl5/lib/perl5/ -Mlocal::lib)
!
--> Working on FFI::Platypus
Fetching http://www.cpan.org/authors/id/P/PL/PLICEASE/FFI-Platypus-2.12.tar.gz ... OK
==> Found dependencies: Capture::Tiny
--> Working on Capture::Tiny
Fetching http://www.cpan.org/authors/id/D/DA/DAGOLDEN/Capture-Tiny-0.50.tar.gz ... OK
Configuring Capture-Tiny-0.50 ... OK
Building Capture-Tiny-0.50 ... OK
Successfully installed Capture-Tiny-0.50
Configuring FFI-Platypus-2.12 ... OK
==> Found dependencies: FFI::CheckLib
--> Working on FFI::CheckLib
Fetching http://www.cpan.org/authors/id/P/PL/PLICEASE/FFI-CheckLib-0.31.tar.gz ... OK
Configuring FFI-CheckLib-0.31 ... OK
==> Found dependencies: File::Which
--> Working on File::Which
Fetching http://www.cpan.org/authors/id/P/PL/PLICEASE/File-Which-1.27.tar.gz ... OK
Configuring File-Which-1.27 ... OK
Building File-Which-1.27 ... OK
Successfully installed File-Which-1.27
Building FFI-CheckLib-0.31 ... OK
Successfully installed FFI-CheckLib-0.31
Building FFI-Platypus-2.12 ... OK
Successfully installed FFI-Platypus-2.12
4 distributions installed
# Azul language-binding AZ_E2E status board
Host: Linux | lib: /home/runner/work/azul/azul/target/release/libazul.so
Scenario: /home/runner/work/azul/azul/tests/e2e/hello_world_counter.json
Logs: /tmp/azul-e2e-matrix.NiATa5
| language | tier | status | note |
|----------|------|--------|------|
| python | shipped | ✓ WORKS | test result: ok |
| lua | shipped | ✓ WORKS | test result: ok |
| ruby | shipped | ✓ WORKS | test result: ok |
| node | shipped | ✓ WORKS | test result: ok |
| go | shipped | ✓ WORKS | test result: ok |
| zig | shipped | ✓ WORKS | test result: ok |
| nim | beta | ✓ WORKS | test result: ok |
| fortran | shipped | ✓ WORKS | test result: ok |
| pascal | shipped | ✓ WORKS | test result: ok |
| perl | alpha | ⊘ SKIP | FFI::Platypus not installed (cpanm FFI::Platypus) |
Tally: 9 ✓ WORKS / 0 ✗ FAILS / 1 ⊘ SKIP (of 10 languages); SHIPPED failures: 0
===== language-bindings-ubuntu-scripting-x1.txt =====
Reading package lists...
Building dependency tree...
Reading state information...
The following additional packages will be installed:
libclang-14-dev llvm llvm-runtime
The following NEW packages will be installed:
libclang-14-dev libclang-dev llvm llvm-dev llvm-runtime php-cli
0 upgraded, 6 newly installed, 0 to remove and 79 not upgraded.
Need to get 25.2 MB of archives.
After this operation, 245 MB of additional disk space will be used.
Get:1 file:/etc/apt/apt-mirrors.txt Mirrorlist [144 B]
Get:2 http://azure.archive.ubuntu.com/ubuntu jammy-updates/universe amd64 libclang-14-dev amd64 1:14.0.0-1ubuntu1.1 [25.2 MB]
Get:3 http://azure.archive.ubuntu.com/ubuntu jammy/universe amd64 libclang-dev amd64 1:14.0-55~exp2 [3138 B]
Get:4 http://azure.archive.ubuntu.com/ubuntu jammy/universe amd64 llvm-runtime amd64 1:14.0-55~exp2 [3204 B]
Get:5 http://azure.archive.ubuntu.com/ubuntu jammy/universe amd64 llvm amd64 1:14.0-55~exp2 [3758 B]
Get:6 http://azure.archive.ubuntu.com/ubuntu jammy/universe amd64 llvm-dev amd64 1:14.0-55~exp2 [1656 B]
Get:7 http://azure.archive.ubuntu.com/ubuntu jammy/main amd64 php-cli all 2:8.1+92ubuntu1 [3234 B]
Fetched 25.2 MB in 1s (29.8 MB/s)
Selecting previously unselected package libclang-14-dev.
(Reading database ...
(Reading database ... 5%
(Reading database ... 10%
(Reading database ... 15%
(Reading database ... 20%
(Reading database ... 25%
(Reading database ... 30%
(Reading database ... 35%
(Reading database ... 40%
(Reading database ... 45%
(Reading database ... 50%
(Reading database ... 55%
(Reading database ... 60%
(Reading database ... 65%
(Reading database ... 70%
(Reading database ... 75%
(Reading database ... 80%
(Reading database ... 85%
(Reading database ... 90%
(Reading database ... 95%
(Reading database ... 100%
(Reading database ... 263138 files and directories currently installed.)
Preparing to unpack .../0-libclang-14-dev_1%3a14.0.0-1ubuntu1.1_amd64.deb ...
Unpacking libclang-14-dev (1:14.0.0-1ubuntu1.1) ...
Selecting previously unselected package libclang-dev.
Preparing to unpack .../1-libclang-dev_1%3a14.0-55~exp2_amd64.deb ...
Unpacking libclang-dev (1:14.0-55~exp2) ...
Selecting previously unselected package llvm-runtime:amd64.
Preparing to unpack .../2-llvm-runtime_1%3a14.0-55~exp2_amd64.deb ...
Unpacking llvm-runtime:amd64 (1:14.0-55~exp2) ...
Selecting previously unselected package llvm.
Preparing to unpack .../3-llvm_1%3a14.0-55~exp2_amd64.deb ...
Unpacking llvm (1:14.0-55~exp2) ...
Selecting previously unselected package llvm-dev.
Preparing to unpack .../4-llvm-dev_1%3a14.0-55~exp2_amd64.deb ...
Unpacking llvm-dev (1:14.0-55~exp2) ...
Selecting previously unselected package php-cli.
Preparing to unpack .../5-php-cli_2%3a8.1+92ubuntu1_all.deb ...
Unpacking php-cli (2:8.1+92ubuntu1) ...
Setting up llvm-runtime:amd64 (1:14.0-55~exp2) ...
Setting up llvm (1:14.0-55~exp2) ...
Setting up php-cli (2:8.1+92ubuntu1) ...
update-alternatives: using /usr/bin/php.default to provide /usr/bin/php (php) in auto mode
update-alternatives: using /usr/bin/phar.default to provide /usr/bin/phar (phar) in auto mode
update-alternatives: using /usr/bin/phar.phar.default to provide /usr/bin/phar.phar (phar.phar) in auto mode
Setting up libclang-14-dev (1:14.0.0-1ubuntu1.1) ...
Setting up llvm-dev (1:14.0-55~exp2) ...
Setting up libclang-dev (1:14.0-55~exp2) ...
Processing triggers for man-db (2.10.2-1) ...
Not building database; man-db/auto-update is not 'true'.
Running kernel seems to be up-to-date.
Services to be restarted:
systemctl restart chrony.service
systemctl restart containerd.service
systemctl restart cron.service
systemctl restart haveged.service
systemctl restart hv-kvp-daemon.service
systemctl restart irqbalance.service
systemctl restart mono-xsp4.service
systemctl restart multipathd.service
systemctl restart packagekit.service
systemctl restart php8.1-fpm.service
systemctl restart polkit.service
systemctl restart rsyslog.service
systemctl restart serial-getty@ttyS0.service
systemctl restart snapd.service
systemctl restart ssh.service
systemctl restart systemd-journald.service
systemctl restart systemd-networkd.service
systemctl restart systemd-resolved.service
systemctl restart systemd-udevd.service
Service restarts being deferred:
/etc/needrestart/restart.d/dbus.service
systemctl restart docker.service
systemctl restart getty@tty1.service
systemctl restart hosted-compute-agent.service
systemctl restart networkd-dispatcher.service
systemctl restart systemd-logind.service
systemctl restart user@1001.service
systemctl restart walinuxagent.service
No containers need to be restarted.
No user sessions are running outdated binaries.
No VM guests are running outdated hypervisor (qemu) binaries on this host.
Reading package lists...
Building dependency tree...
Reading state information...
The following packages will be REMOVED:
libclang-dev llvm-dev
0 upgraded, 0 newly installed, 2 to remove and 79 not upgraded.
After this operation, 48.1 kB disk space will be freed.
(Reading database ...
(Reading database ... 5%
(Reading database ... 10%
(Reading database ... 15%
(Reading database ... 20%
(Reading database ... 25%
(Reading database ... 30%
(Reading database ... 35%
(Reading database ... 40%
(Reading database ... 45%
(Reading database ... 50%
(Reading database ... 55%
(Reading database ... 60%
(Reading database ... 65%
(Reading database ... 70%
(Reading database ... 75%
(Reading database ... 80%
(Reading database ... 85%
(Reading database ... 90%
(Reading database ... 95%
(Reading database ... 100%
(Reading database ... 264408 files and directories currently installed.)
Removing libclang-dev (1:14.0-55~exp2) ...
Removing llvm-dev (1:14.0-55~exp2) ...
Reading package lists...
Building dependency tree...
Reading state information...
The following packages will be REMOVED:
apport-symptoms bc landscape-common libclang-14-dev libintl-perl
libintl-xs-perl libisns0 liblldb-13 liblldb-15 libmodule-find-perl
libmodule-scandeps-perl libmspack0 libopeniscsiusr libproc-processtable-perl
libsort-naturally-perl libterm-readkey-perl libxmlsec1 libxmlsec1-openssl
llvm llvm-runtime lxd-agent-loader needrestart open-iscsi open-vm-tools
python3-apport python3-automat python3-bcrypt python3-click python3-colorama
python3-constantly python3-hamcrest python3-hyperlink python3-incremental
python3-problem-report python3-pyasn1 python3-pyasn1-modules
python3-service-identity python3-systemd python3-twisted
python3-zope.interface zerofree
0 upgraded, 0 newly installed, 41 to remove and 79 not upgraded.
After this operation, 308 MB disk space will be freed.
(Reading database ...
(Reading database ... 5%
(Reading database ... 10%
(Reading database ... 15%
(Reading database ... 20%
(Reading database ... 25%
(Reading database ... 30%
(Reading database ... 35%
(Reading database ... 40%
(Reading database ... 45%
(Reading database ... 50%
(Reading database ... 55%
(Reading database ... 60%
(Reading database ... 65%
(Reading database ... 70%
(Reading database ... 75%
(Reading database ... 80%
(Reading database ... 85%
(Reading database ... 90%
(Reading database ... 95%
(Reading database ... 100%
(Reading database ... 264393 files and directories currently installed.)
Removing apport-symptoms (0.24) ...
Removing landscape-common (23.02-0ubuntu1~22.04.7) ...
Removing bc (1.07.1-3build1) ...
Removing libclang-14-dev (1:14.0.0-1ubuntu1.1) ...
Removing libintl-xs-perl (1.26-3build2) ...
Removing needrestart (3.5-5ubuntu2.5) ...
Removing libintl-perl (1.26-3build2) ...
Removing open-iscsi (2.1.5-1ubuntu1.1) ...
Warning: Stopping iscsid.service, but it can still be activated by:
iscsid.socket
Removing libisns0:amd64 (0.101-0ubuntu2) ...
Removing liblldb-13 (1:13.0.1-2ubuntu2.2) ...
Removing liblldb-15 (1:15.0.7-0ubuntu0.22.04.3) ...
Removing libmodule-find-perl (0.15-1) ...
Removing libmodule-scandeps-perl (1.31-1ubuntu0.1) ...
Removing open-vm-tools (2:12.3.5-3~ubuntu0.22.04.3) ...
Removing libmspack0:amd64 (0.10.1-2build2) ...
Removing libopeniscsiusr (2.1.5-1ubuntu1.1) ...
Removing libproc-processtable-perl:amd64 (0.634-1build1) ...
Removing libsort-naturally-perl (1.03-2) ...
Removing libterm-readkey-perl (2.38-1build4) ...
Removing libxmlsec1-openssl:amd64 (1.2.33-1build2) ...
Removing libxmlsec1:amd64 (1.2.33-1build2) ...
Removing llvm (1:14.0-55~exp2) ...
Removing llvm-runtime:amd64 (1:14.0-55~exp2) ...
Removing lxd-agent-loader (0.5) ...
Removing python3-apport (2.20.11-0ubuntu82.10) ...
Removing python3-twisted (22.1.0-2ubuntu2.7) ...
Removing python3-automat (20.2.0-1) ...
Removing python3-bcrypt (3.2.0-1build1) ...
Removing python3-click (8.0.3-1) ...
Removing python3-colorama (0.4.4-1) ...
Removing python3-constantly (15.1.0-2) ...
Removing python3-hamcrest (2.0.2-2) ...
Removing python3-hyperlink (21.0.0-3) ...
Removing python3-incremental (21.3.0-1) ...
Removing python3-problem-report (2.20.11-0ubuntu82.10) ...
Removing python3-service-identity (18.1.0-6) ...
Removing python3-pyasn1-modules (0.2.1-1) ...
Removing python3-pyasn1 (0.4.8-1ubuntu0.3) ...
Removing python3-systemd (234-3ubuntu2) ...
Removing python3-zope.interface (5.4.0-1build1) ...
Removing zerofree (1.1.1-1build3) ...
Processing triggers for libc-bin (2.35-0ubuntu3.14) ...
Processing triggers for man-db (2.10.2-1) ...
Not building database; man-db/auto-update is not 'true'.
Processing triggers for install-info (6.8-4build1) ...
Processing triggers for initramfs-tools (0.140ubuntu13.5) ...
update-initramfs: Generating /boot/initrd.img-6.8.0-1064-azure
Reading package lists...
Building dependency tree...
Reading state information...
Suggested packages:
sbcl-doc sbcl-source slime
The following NEW packages will be installed:
sbcl
0 upgraded, 1 newly installed, 0 to remove and 79 not upgraded.
Need to get 10.6 MB of archives.
After this operation, 46.3 MB of additional disk space will be used.
Get:1 file:/etc/apt/apt-mirrors.txt Mirrorlist [144 B]
Get:2 http://azure.archive.ubuntu.com/ubuntu jammy/universe amd64 sbcl amd64 2:2.1.11-1 [10.6 MB]
Fetched 10.6 MB in 0s (39.5 MB/s)
Selecting previously unselected package sbcl.
(Reading database ...
(Reading database ... 5%
(Reading database ... 10%
(Reading database ... 15%
(Reading database ... 20%
(Reading database ... 25%
(Reading database ... 30%
(Reading database ... 35%
(Reading database ... 40%
(Reading database ... 45%
(Reading database ... 50%
(Reading database ... 55%
(Reading database ... 60%
(Reading database ... 65%
(Reading database ... 70%
(Reading database ... 75%
(Reading database ... 80%
(Reading database ... 85%
(Reading database ... 90%
(Reading database ... 95%
(Reading database ... 100%
(Reading database ... 260984 files and directories currently installed.)
Preparing to unpack .../sbcl_2%3a2.1.11-1_amd64.deb ...
Unpacking sbcl (2:2.1.11-1) ...
Setting up sbcl (2:2.1.11-1) ...
Processing triggers for man-db (2.10.2-1) ...
Not building database; man-db/auto-update is not 'true'.
This is SBCL 2.1.11.debian, an implementation of ANSI Common Lisp.
More information about SBCL is available at .
SBCL is free software, provided as is, with absolutely no warranty.
It is mostly in the public domain; some portions are provided under
BSD-style licenses. See the CREDITS and COPYING files in the
distribution for more information.
==== quicklisp quickstart 2015-01-28 loaded ====
To continue with installation, evaluate: (quicklisp-quickstart:install)
For installation options, evaluate: (quicklisp-quickstart:help)
; Fetching #
; 0.82KB
==================================================
839 bytes in 0.00 seconds (0.00KB/sec)
; Fetching #
; 260.00KB
==================================================
266,240 bytes in 0.01 seconds (43333.33KB/sec)
; Fetching #
; 4.94KB
==================================================
5,057 bytes in 0.00 seconds (0.00KB/sec)
; Fetching #
; 628.18KB
==================================================
643,253 bytes in 0.01 seconds (89739.54KB/sec)
; Fetching #
; 0.40KB
==================================================
408 bytes in 0.00 seconds (0.00KB/sec)
Installing dist "quicklisp" version "2026-01-01".
; Fetching #
; 564.04KB
==================================================
577,575 bytes in 0.01 seconds (80576.87KB/sec)
; Fetching #
; 458.96KB
==================================================
469,975 bytes in 0.01 seconds (76493.33KB/sec)
==== quicklisp installed ====
To load a system, use: (ql:quickload "system-name")
To find systems, use: (ql:system-apropos "term")
To load Quicklisp every time you start Lisp, use: (ql:add-to-init-file)
For more information, see http://www.quicklisp.org/beta/
Reading package lists...
Building dependency tree...
Reading state information...
The following packages will be REMOVED:
sbcl
0 upgraded, 0 newly installed, 1 to remove and 79 not upgraded.
After this operation, 46.3 MB disk space will be freed.
(Reading database ...
(Reading database ... 5%
(Reading database ... 10%
(Reading database ... 15%
(Reading database ... 20%
(Reading database ... 25%
(Reading database ... 30%
(Reading database ... 35%
(Reading database ... 40%
(Reading database ... 45%
(Reading database ... 50%
(Reading database ... 55%
(Reading database ... 60%
(Reading database ... 65%
(Reading database ... 70%
(Reading database ... 75%
(Reading database ... 80%
(Reading database ... 85%
(Reading database ... 90%
(Reading database ... 95%
(Reading database ... 100%
(Reading database ... 261045 files and directories currently installed.)
Removing sbcl (2:2.1.11-1) ...
Processing triggers for man-db (2.10.2-1) ...
Not building database; man-db/auto-update is not 'true'.
Reading package lists...
Building dependency tree...
Reading state information...
0 upgraded, 0 newly installed, 0 to remove and 79 not upgraded.
Reading package lists...
Building dependency tree...
Reading state information...
The following additional packages will be installed:
gnucobol3 libcob4 libcob4-dev
The following NEW packages will be installed:
gnucobol gnucobol3 libcob4 libcob4-dev
0 upgraded, 4 newly installed, 0 to remove and 79 not upgraded.
Need to get 1421 kB of archives.
After this operation, 4208 kB of additional disk space will be used.
Get:1 file:/etc/apt/apt-mirrors.txt Mirrorlist [144 B]
Get:2 http://azure.archive.ubuntu.com/ubuntu jammy/universe amd64 libcob4 amd64 3.1.2-5 [179 kB]
Get:3 http://azure.archive.ubuntu.com/ubuntu jammy/universe amd64 libcob4-dev amd64 3.1.2-5 [224 kB]
Get:4 http://azure.archive.ubuntu.com/ubuntu jammy/universe amd64 gnucobol3 amd64 3.1.2-5 [1017 kB]
Get:5 http://azure.archive.ubuntu.com/ubuntu jammy/universe amd64 gnucobol amd64 5 [1840 B]
Fetched 1421 kB in 0s (5203 kB/s)
Selecting previously unselected package libcob4:amd64.
(Reading database ...
(Reading database ... 5%
(Reading database ... 10%
(Reading database ... 15%
(Reading database ... 20%
(Reading database ... 25%
(Reading database ... 30%
(Reading database ... 35%
(Reading database ... 40%
(Reading database ... 45%
(Reading database ... 50%
(Reading database ... 55%
(Reading database ... 60%
(Reading database ... 65%
(Reading database ... 70%
(Reading database ... 75%
(Reading database ... 80%
(Reading database ... 85%
(Reading database ... 90%
(Reading database ... 95%
(Reading database ... 100%
(Reading database ... 260985 files and directories currently installed.)
Preparing to unpack .../libcob4_3.1.2-5_amd64.deb ...
Unpacking libcob4:amd64 (3.1.2-5) ...
Selecting previously unselected package libcob4-dev:amd64.
Preparing to unpack .../libcob4-dev_3.1.2-5_amd64.deb ...
Unpacking libcob4-dev:amd64 (3.1.2-5) ...
Selecting previously unselected package gnucobol3.
Preparing to unpack .../gnucobol3_3.1.2-5_amd64.deb ...
Unpacking gnucobol3 (3.1.2-5) ...
Selecting previously unselected package gnucobol.
Preparing to unpack .../archives/gnucobol_5_amd64.deb ...
Unpacking gnucobol (5) ...
Setting up libcob4:amd64 (3.1.2-5) ...
Setting up libcob4-dev:amd64 (3.1.2-5) ...
Setting up gnucobol3 (3.1.2-5) ...
Setting up gnucobol (5) ...
Processing triggers for libc-bin (2.35-0ubuntu3.14) ...
Processing triggers for man-db (2.10.2-1) ...
Not building database; man-db/auto-update is not 'true'.
Processing triggers for install-info (6.8-4build1) ...
Reading package lists...
Building dependency tree...
Reading state information...
The following packages will be REMOVED:
gnucobol
0 upgraded, 0 newly installed, 1 to remove and 79 not upgraded.
After this operation, 8192 B disk space will be freed.
(Reading database ...
(Reading database ... 5%
(Reading database ... 10%
(Reading database ... 15%
(Reading database ... 20%
(Reading database ... 25%
(Reading database ... 30%
(Reading database ... 35%
(Reading database ... 40%
(Reading database ... 45%
(Reading database ... 50%
(Reading database ... 55%
(Reading database ... 60%
(Reading database ... 65%
(Reading database ... 70%
(Reading database ... 75%
(Reading database ... 80%
(Reading database ... 85%
(Reading database ... 90%
(Reading database ... 95%
(Reading database ... 100%
(Reading database ... 261067 files and directories currently installed.)
Removing gnucobol (5) ...
Reading package lists...
Building dependency tree...
Reading state information...
The following packages will be REMOVED:
gnucobol3 libcob4 libcob4-dev
0 upgraded, 0 newly installed, 3 to remove and 79 not upgraded.
After this operation, 4199 kB disk space will be freed.
(Reading database ...
(Reading database ... 5%
(Reading database ... 10%
(Reading database ... 15%
(Reading database ... 20%
(Reading database ... 25%
(Reading database ... 30%
(Reading database ... 35%
(Reading database ... 40%
(Reading database ... 45%
(Reading database ... 50%
(Reading database ... 55%
(Reading database ... 60%
(Reading database ... 65%
(Reading database ... 70%
(Reading database ... 75%
(Reading database ... 80%
(Reading database ... 85%
(Reading database ... 90%
(Reading database ... 95%
(Reading database ... 100%
(Reading database ... 261064 files and directories currently installed.)
Removing gnucobol3 (3.1.2-5) ...
Removing libcob4-dev:amd64 (3.1.2-5) ...
Removing libcob4:amd64 (3.1.2-5) ...
Processing triggers for man-db (2.10.2-1) ...
Not building database; man-db/auto-update is not 'true'.
Processing triggers for install-info (6.8-4build1) ...
Processing triggers for libc-bin (2.35-0ubuntu3.14) ...
Reading package lists...
Building dependency tree...
Reading state information...
The following additional packages will be installed:
gnat-10 libgnat-10 libgnat-util10
Suggested packages:
ada-reference-manual-2012 gnat-10-doc gnat-10-sjlj
The following NEW packages will be installed:
gnat gnat-10 libgnat-10 libgnat-util10
0 upgraded, 4 newly installed, 0 to remove and 79 not upgraded.
Need to get 18.6 MB of archives.
After this operation, 80.6 MB of additional disk space will be used.
Get:1 file:/etc/apt/apt-mirrors.txt Mirrorlist [144 B]
Get:2 http://azure.archive.ubuntu.com/ubuntu jammy-updates/universe amd64 libgnat-10 amd64 10.5.0-1ubuntu1~22.04.3 [1219 kB]
Get:3 http://azure.archive.ubuntu.com/ubuntu jammy-updates/universe amd64 libgnat-util10 amd64 10.5.0-1ubuntu1~22.04.3 [433 kB]
Get:4 http://azure.archive.ubuntu.com/ubuntu jammy-updates/universe amd64 gnat-10 amd64 10.5.0-1ubuntu1~22.04.3 [17.0 MB]
Get:5 http://azure.archive.ubuntu.com/ubuntu jammy/universe amd64 gnat amd64 10.1ubuntu1 [2572 B]
Fetched 18.6 MB in 0s (38.4 MB/s)
Selecting previously unselected package libgnat-10:amd64.
(Reading database ...
(Reading database ... 5%
(Reading database ... 10%
(Reading database ... 15%
(Reading database ... 20%
(Reading database ... 25%
(Reading database ... 30%
(Reading database ... 35%
(Reading database ... 40%
(Reading database ... 45%
(Reading database ... 50%
(Reading database ... 55%
(Reading database ... 60%
(Reading database ... 65%
(Reading database ... 70%
(Reading database ... 75%
(Reading database ... 80%
(Reading database ... 85%
(Reading database ... 90%
(Reading database ... 95%
(Reading database ... 100%
(Reading database ... 261018 files and directories currently installed.)
Preparing to unpack .../libgnat-10_10.5.0-1ubuntu1~22.04.3_amd64.deb ...
Unpacking libgnat-10:amd64 (10.5.0-1ubuntu1~22.04.3) ...
Selecting previously unselected package libgnat-util10:amd64.
Preparing to unpack .../libgnat-util10_10.5.0-1ubuntu1~22.04.3_amd64.deb ...
Unpacking libgnat-util10:amd64 (10.5.0-1ubuntu1~22.04.3) ...
Selecting previously unselected package gnat-10.
Preparing to unpack .../gnat-10_10.5.0-1ubuntu1~22.04.3_amd64.deb ...
Unpacking gnat-10 (10.5.0-1ubuntu1~22.04.3) ...
Selecting previously unselected package gnat.
Preparing to unpack .../gnat_10.1ubuntu1_amd64.deb ...
Unpacking gnat (10.1ubuntu1) ...
Setting up libgnat-10:amd64 (10.5.0-1ubuntu1~22.04.3) ...
Setting up libgnat-util10:amd64 (10.5.0-1ubuntu1~22.04.3) ...
Setting up gnat-10 (10.5.0-1ubuntu1~22.04.3) ...
Setting up gnat (10.1ubuntu1) ...
Processing triggers for man-db (2.10.2-1) ...
Not building database; man-db/auto-update is not 'true'.
Processing triggers for libc-bin (2.35-0ubuntu3.14) ...
Reading package lists...
Building dependency tree...
Reading state information...
The following packages will be REMOVED:
gnat
0 upgraded, 0 newly installed, 1 to remove and 79 not upgraded.
After this operation, 10.2 kB disk space will be freed.
(Reading database ...
(Reading database ... 5%
(Reading database ... 10%
(Reading database ... 15%
(Reading database ... 20%
(Reading database ... 25%
(Reading database ... 30%
(Reading database ... 35%
(Reading database ... 40%
(Reading database ... 45%
(Reading database ... 50%
(Reading database ... 55%
(Reading database ... 60%
(Reading database ... 65%
(Reading database ... 70%
(Reading database ... 75%
(Reading database ... 80%
(Reading database ... 85%
(Reading database ... 90%
(Reading database ... 95%
(Reading database ... 100%
(Reading database ... 263173 files and directories currently installed.)
Removing gnat (10.1ubuntu1) ...
Reading package lists...
Building dependency tree...
Reading state information...
The following packages will be REMOVED:
gnat-10 libgnat-10 libgnat-util10
0 upgraded, 0 newly installed, 3 to remove and 79 not upgraded.
After this operation, 80.6 MB disk space will be freed.
(Reading database ...
(Reading database ... 5%
(Reading database ... 10%
(Reading database ... 15%
(Reading database ... 20%
(Reading database ... 25%
(Reading database ... 30%
(Reading database ... 35%
(Reading database ... 40%
(Reading database ... 45%
(Reading database ... 50%
(Reading database ... 55%
(Reading database ... 60%
(Reading database ... 65%
(Reading database ... 70%
(Reading database ... 75%
(Reading database ... 80%
(Reading database ... 85%
(Reading database ... 90%
(Reading database ... 95%
(Reading database ... 100%
(Reading database ... 263170 files and directories currently installed.)
Removing gnat-10 (10.5.0-1ubuntu1~22.04.3) ...
Removing libgnat-util10:amd64 (10.5.0-1ubuntu1~22.04.3) ...
Removing libgnat-10:amd64 (10.5.0-1ubuntu1~22.04.3) ...
Processing triggers for man-db (2.10.2-1) ...
Not building database; man-db/auto-update is not 'true'.
Processing triggers for libc-bin (2.35-0ubuntu3.14) ...
Reading package lists...
Building dependency tree...
Reading state information...
The following NEW packages will be installed:
algol68g
0 upgraded, 1 newly installed, 0 to remove and 79 not upgraded.
Need to get 418 kB of archives.
After this operation, 1220 kB of additional disk space will be used.
Get:1 file:/etc/apt/apt-mirrors.txt Mirrorlist [144 B]
Get:2 http://azure.archive.ubuntu.com/ubuntu jammy/universe amd64 algol68g amd64 2.8.4-1 [418 kB]
Fetched 418 kB in 0s (4638 kB/s)
Selecting previously unselected package algol68g.
(Reading database ...
(Reading database ... 5%
(Reading database ... 10%
(Reading database ... 15%
(Reading database ... 20%
(Reading database ... 25%
(Reading database ... 30%
(Reading database ... 35%
(Reading database ... 40%
(Reading database ... 45%
(Reading database ... 50%
(Reading database ... 55%
(Reading database ... 60%
(Reading database ... 65%
(Reading database ... 70%
(Reading database ... 75%
(Reading database ... 80%
(Reading database ... 85%
(Reading database ... 90%
(Reading database ... 95%
(Reading database ... 100%
(Reading database ... 261018 files and directories currently installed.)
Preparing to unpack .../algol68g_2.8.4-1_amd64.deb ...
Unpacking algol68g (2.8.4-1) ...
Setting up algol68g (2.8.4-1) ...
Processing triggers for man-db (2.10.2-1) ...
Not building database; man-db/auto-update is not 'true'.
Reading package lists...
Building dependency tree...
Reading state information...
The following packages will be REMOVED:
algol68g
0 upgraded, 0 newly installed, 1 to remove and 79 not upgraded.
After this operation, 1220 kB disk space will be freed.
(Reading database ...
(Reading database ... 5%
(Reading database ... 10%
(Reading database ... 15%
(Reading database ... 20%
(Reading database ... 25%
(Reading database ... 30%
(Reading database ... 35%
(Reading database ... 40%
(Reading database ... 45%
(Reading database ... 50%
(Reading database ... 55%
(Reading database ... 60%
(Reading database ... 65%
(Reading database ... 70%
(Reading database ... 75%
(Reading database ... 80%
(Reading database ... 85%
(Reading database ... 90%
(Reading database ... 95%
(Reading database ... 100%
(Reading database ... 261029 files and directories currently installed.)
Removing algol68g (2.8.4-1) ...
Processing triggers for man-db (2.10.2-1) ...
Not building database; man-db/auto-update is not 'true'.
Reading package lists...
Building dependency tree...
Reading state information...
0 upgraded, 0 newly installed, 0 to remove and 79 not upgraded.
# Azul language-binding AZ_E2E status board
Host: Linux | lib: /home/runner/work/azul/azul/target/release/libazul.so
Scenario: /home/runner/work/azul/azul/tests/e2e/hello_world_counter.json
Logs: /tmp/azul-e2e-matrix.RB5phB
| language | tier | status | note |
|----------|------|--------|------|
| php | alpha | ⊘ SKIP | php-extension build unavailable (see log; needs libclang + ext-php-rs toolchain) |
| lisp | alpha | ✗ FAILS | no 'test result: ok' (see log) |
| cobol | alpha | ✗ FAILS | compile/link error (see log) |
| ada | alpha | ✗ FAILS | compile/link error (see log) |
| algol68 | alpha | ✗ FAILS | no 'test result: ok' (see log) |
Tally: 0 ✓ WORKS / 4 ✗ FAILS / 1 ⊘ SKIP (of 5 languages); SHIPPED failures: 0
===== FAILED binding logs (last 80 lines each) =====
::group::✗ lisp [alpha] — no 'test result: ok' (see log)
----- lisp [alpha]: no 'test result: ok' (see log) -----
..................................................
..................................................
..................................................
..................................................
..................................................
..................................................
..................................................
..................................................
..................................................
..................................................
..................................................
..................................................
..................................................
..................................................
..................................................
..................................................
..................................................
..................................................
..................................................
..................................................
..................................................
..................................................
..................................................
..................................................
..................................................
..................................................
..................................................
..................................................
..................................................
..................................................
..................................................
..................................................
..................................................
..................................................
..................................................
..................................................
..................................................
..................................................
..................................................
..................................................
..................................................
..................................................
..................................................
..................................................
..................................................
..................................................
..................................................
..................................................
..................................................
..................................................
[package azul-hello].
Unhandled SIMPLE-ERROR in thread #:
32630 is not defined as a value for enum type #.
Backtrace for: #
0: (SB-DEBUG::DEBUGGER-DISABLED-HOOK # # :QUIT T)
1: (SB-DEBUG::RUN-HOOK *INVOKE-DEBUGGER-HOOK* #)
2: (INVOKE-DEBUGGER #)
3: (ERROR "~S is not defined as a value for enum type ~S." 32630 #)
4: (CFFI::%FOREIGN-ENUM-KEYWORD # 32630 :ERRORP T)
5: ((:METHOD CFFI:TRANSLATE-FROM-FOREIGN (T CFFI::FOREIGN-STRUCT-TYPE)) #.(SB-SYS:INT-SAP #X7F7617B87784) #) [fast-method]
6: ((:METHOD CFFI:TRANSLATE-FROM-FOREIGN (T CFFI::FOREIGN-STRUCT-TYPE)) #.(SB-SYS:INT-SAP #X7F7617B87780) #) [fast-method]
7: ((:METHOD CFFI:TRANSLATE-FROM-FOREIGN (T CFFI::FOREIGN-STRUCT-TYPE)) #.(SB-SYS:INT-SAP #X7F7617B87780) #) [fast-method]
8: ((:METHOD CFFI:TRANSLATE-FROM-FOREIGN (T CFFI::FOREIGN-STRUCT-TYPE)) #.(SB-SYS:INT-SAP #X7F7617B87718) #) [fast-method]
9: ((:METHOD CFFI:TRANSLATE-FROM-FOREIGN (T CFFI::FOREIGN-STRUCT-TYPE)) #.(SB-SYS:INT-SAP #X7F7617B87710) #) [fast-method]
10: ((:METHOD CFFI:TRANSLATE-FROM-FOREIGN (T CFFI::FOREIGN-STRUCT-TYPE)) #.(SB-SYS:INT-SAP #X7F7617B87710) #) [fast-method]
11: ((:METHOD CFFI:TRANSLATE-FROM-FOREIGN (T CFFI::FOREIGN-STRUCT-TYPE)) #.(SB-SYS:INT-SAP #X7F7617B87698) #) [fast-method]
12: (AZUL-INTERNAL::%AZ-APP-CONFIG-CREATE)
13: (AZUL:MAKE-APP-CONFIG-CREATE)
14: (AZUL-HELLO:RUN-APP)
15: (SB-INT:SIMPLE-EVAL-IN-LEXENV (AZUL-HELLO:RUN-APP) #)
16: (EVAL (AZUL-HELLO:RUN-APP))
17: (SB-IMPL::PROCESS-EVAL/LOAD-OPTIONS ((:EVAL . "(load \"/home/runner/quicklisp/setup.lisp\")") (:EVAL . "(push (truename \".\") asdf:*central-registry*)") (:EVAL . "(ql:quickload :azul-example)") (:EVAL . "(azul-hello:run-app)") (:QUIT)))
18: (SB-IMPL::TOPLEVEL-INIT)
19: ((FLET SB-UNIX::BODY :IN SB-IMPL::START-LISP))
20: ((FLET "WITHOUT-INTERRUPTS-BODY-3" :IN SB-IMPL::START-LISP))
21: (SB-IMPL::START-LISP)
unhandled condition in --disable-debugger mode, quitting
::endgroup::
::group::✗ cobol [alpha] — compile/link error (see log)
----- cobol [alpha]: compile/link error (see log) -----
azul.cpy:7898: error: invalid PICTURE character 'Y'
azul.cpy:7898: error: invalid PICTURE character 'L'
azul.cpy:7898: error: invalid PICTURE character 'O'
azul.cpy:7898: error: invalid PICTURE character 'G'
azul.cpy:7898: error: A or X cannot follow N
azul.cpy:7898: error: a leading +/- sign cannot follow B, 0 or /
azul.cpy:7898: error: a leading +/- sign cannot follow A or X
azul.cpy:7898: error: a leading +/- sign cannot follow N
azul.cpy:7898: error: N cannot follow a leading +/- sign
azul.cpy:7898: error: N cannot follow A or X
azul.cpy:7898: error: invalid PICTURE character 'I'
azul.cpy:7898: warning: handling of USAGE NATIONAL is unfinished; implementation is likely to be changed [-Wunfinished]
azul.cpy:7898: error: invalid PICTURE character 'R'
azul.cpy:7898: error: invalid PICTURE character 'Y'
azul.cpy:7898: error: invalid PICTURE character 'L'
azul.cpy:7898: error: invalid PICTURE character 'O'
azul.cpy:7898: error: invalid PICTURE character 'G'
azul.cpy:7898: error: A or X cannot follow N
azul.cpy:7898: error: a leading +/- sign cannot follow B, 0 or /
azul.cpy:7898: error: a leading +/- sign cannot follow A or X
azul.cpy:7898: error: a leading +/- sign cannot follow N
azul.cpy:7898: error: N cannot follow a leading +/- sign
azul.cpy:7898: error: N cannot follow A or X
azul.cpy:7898: error: PICTURE clause not compatible with USAGE COMP-5
azul.cpy:7898: error: PICTURE clause not compatible with USAGE COMP-5
azul.cpy:7898: error: invalid PICTURE character 'I'
azul.cpy:7898: warning: handling of USAGE NATIONAL is unfinished; implementation is likely to be changed [-Wunfinished]
azul.cpy:7898: error: invalid PICTURE character 'R'
azul.cpy:7898: error: invalid PICTURE character 'Y'
azul.cpy:7898: error: invalid PICTURE character 'L'
azul.cpy:7898: error: invalid PICTURE character 'O'
azul.cpy:7898: error: invalid PICTURE character 'G'
azul.cpy:7898: error: A or X cannot follow N
azul.cpy:7898: error: a leading +/- sign cannot follow B, 0 or /
azul.cpy:7898: error: a leading +/- sign cannot follow A or X
azul.cpy:7898: error: a leading +/- sign cannot follow N
azul.cpy:7898: error: N cannot follow a leading +/- sign
azul.cpy:7898: error: N cannot follow A or X
azul.cpy:7898: error: PICTURE clause not compatible with USAGE COMP-5
azul.cpy:7900: error: 'INNER' cannot have PICTURE clause
azul.cpy:7900: error: 'INNER' cannot have PICTURE clause
azul.cpy:7906: error: invalid PICTURE character 'I'
azul.cpy:7906: warning: handling of USAGE NATIONAL is unfinished; implementation is likely to be changed [-Wunfinished]
azul.cpy:7906: error: invalid PICTURE character 'R'
azul.cpy:7906: error: invalid PICTURE character 'Y'
azul.cpy:7906: error: invalid PICTURE character 'L'
azul.cpy:7906: error: invalid PICTURE character 'O'
azul.cpy:7906: error: invalid PICTURE character 'G'
azul.cpy:7906: error: A or X cannot follow N
azul.cpy:7906: error: a leading +/- sign cannot follow B, 0 or /
azul.cpy:7906: error: a leading +/- sign cannot follow A or X
azul.cpy:7906: error: a leading +/- sign cannot follow N
azul.cpy:7906: error: N cannot follow a leading +/- sign
azul.cpy:7906: error: N cannot follow A or X
azul.cpy:7906: error: 'NUMBER-X' cannot have PICTURE clause
azul.cpy:7906: error: PICTURE clause not compatible with USAGE COMP-5
azul.cpy:7908: error: 'INNER' cannot have PICTURE clause
azul.cpy:7908: error: 'INNER' cannot have PICTURE clause
azul.cpy:7910: error: invalid PICTURE character 'I'
azul.cpy:7910: warning: handling of USAGE NATIONAL is unfinished; implementation is likely to be changed [-Wunfinished]
azul.cpy:7910: error: invalid PICTURE character 'R'
azul.cpy:7910: error: invalid PICTURE character 'Y'
azul.cpy:7910: error: invalid PICTURE character 'L'
azul.cpy:7910: error: invalid PICTURE character 'O'
azul.cpy:7910: error: invalid PICTURE character 'G'
azul.cpy:7910: error: A or X cannot follow N
azul.cpy:7910: error: a leading +/- sign cannot follow B, 0 or /
azul.cpy:7910: error: a leading +/- sign cannot follow A or X
azul.cpy:7910: error: a leading +/- sign cannot follow N
azul.cpy:7910: error: N cannot follow a leading +/- sign
azul.cpy:7910: error: N cannot follow A or X
azul.cpy:7910: error: PICTURE clause not compatible with USAGE COMP-5
azul.cpy:7912: error: 'INNER' cannot have PICTURE clause
azul.cpy:7912: error: 'INNER' cannot have PICTURE clause
azul.cpy:7913: error: 'INNER' cannot have PICTURE clause
azul.cpy:7913: error: 'INNER' cannot have PICTURE clause
cobc: too many errors [-fmax-errors=128]
cobc: aborting compile of azul.cpy at line 7913 (PROGRAM-ID: HELLO-WORLD)
+ exit 1
::endgroup::
::group::✗ ada [alpha] — compile/link error (see log)
----- ada [alpha]: compile/link error (see log) -----
azul.ads:138148:28: "unsigned_long_long" not declared in "C"
azul.ads:138198:28: "unsigned_long_long" not declared in "C"
azul.ads:138232:28: "unsigned_long_long" not declared in "C"
azul.ads:138292:28: "unsigned_long_long" not declared in "C"
azul.ads:138378:28: "unsigned_long_long" not declared in "C"
azul.ads:138402:28: "unsigned_long_long" not declared in "C"
azul.ads:138426:28: "unsigned_long_long" not declared in "C"
azul.ads:138450:28: "unsigned_long_long" not declared in "C"
azul.ads:138474:28: "unsigned_long_long" not declared in "C"
azul.ads:138494:28: "unsigned_long_long" not declared in "C"
azul.ads:138528:28: "unsigned_long_long" not declared in "C"
azul.ads:138562:28: "unsigned_long_long" not declared in "C"
azul.ads:138610:28: "unsigned_long_long" not declared in "C"
azul.ads:138648:28: "unsigned_long_long" not declared in "C"
azul.ads:138686:28: "unsigned_long_long" not declared in "C"
azul.ads:138724:28: "unsigned_long_long" not declared in "C"
azul.ads:138762:28: "unsigned_long_long" not declared in "C"
azul.ads:138796:28: "unsigned_long_long" not declared in "C"
azul.ads:138864:28: "unsigned_long_long" not declared in "C"
azul.ads:138902:28: "unsigned_long_long" not declared in "C"
azul.ads:138940:28: "unsigned_long_long" not declared in "C"
azul.ads:139060:28: "unsigned_long_long" not declared in "C"
azul.ads:139094:28: "unsigned_long_long" not declared in "C"
azul.ads:139200:28: "unsigned_long_long" not declared in "C"
azul.ads:139234:28: "unsigned_long_long" not declared in "C"
azul.ads:139272:28: "unsigned_long_long" not declared in "C"
azul.ads:139310:28: "unsigned_long_long" not declared in "C"
azul.ads:139374:28: "unsigned_long_long" not declared in "C"
azul.ads:139408:28: "unsigned_long_long" not declared in "C"
azul.ads:139474:28: "unsigned_long_long" not declared in "C"
azul.ads:139508:28: "unsigned_long_long" not declared in "C"
azul.ads:139556:28: "unsigned_long_long" not declared in "C"
azul.ads:140097:28: "unsigned_long_long" not declared in "C"
azul.ads:145508:67: "unsigned_long_long" not declared in "C"
azul.ads:145511:75: "unsigned_long_long" not declared in "C"
azul.ads:145514:86: "unsigned_long_long" not declared in "C"
azul.ads:145517:97: "unsigned_long_long" not declared in "C"
azul.ads:145520:100: "unsigned_long_long" not declared in "C"
azul.ads:145523:88: "unsigned_long_long" not declared in "C"
azul.ads:145526:91: "unsigned_long_long" not declared in "C"
azul.ads:145529:97: "unsigned_long_long" not declared in "C"
azul.ads:145532:99: "unsigned_long_long" not declared in "C"
azul.ads:145535:96: "unsigned_long_long" not declared in "C"
azul.ads:145538:93: "unsigned_long_long" not declared in "C"
azul.ads:145541:98: "unsigned_long_long" not declared in "C"
azul.ads:145544:95: "unsigned_long_long" not declared in "C"
azul.ads:145547:95: "unsigned_long_long" not declared in "C"
azul.ads:145550:85: "unsigned_long_long" not declared in "C"
azul.ads:145553:99: "unsigned_long_long" not declared in "C"
azul.ads:145556:96: "unsigned_long_long" not declared in "C"
azul.ads:145559:81: "unsigned_long_long" not declared in "C"
azul.ads:145562:81: "unsigned_long_long" not declared in "C"
azul.ads:145565:81: "unsigned_long_long" not declared in "C"
azul.ads:145568:91: "unsigned_long_long" not declared in "C"
azul.ads:145571:94: "unsigned_long_long" not declared in "C"
azul.ads:145577:58: "unsigned_long_long" not declared in "C"
azul.ads:145580:85: "unsigned_long_long" not declared in "C"
azul.ads:145586:68: "unsigned_long_long" not declared in "C"
azul.ads:145592:79: "unsigned_long_long" not declared in "C"
azul.ads:145598:90: "unsigned_long_long" not declared in "C"
azul.ads:145604:93: "unsigned_long_long" not declared in "C"
azul.ads:145610:81: "unsigned_long_long" not declared in "C"
azul.ads:145616:84: "unsigned_long_long" not declared in "C"
azul.ads:145622:90: "unsigned_long_long" not declared in "C"
azul.ads:145628:92: "unsigned_long_long" not declared in "C"
azul.ads:145634:89: "unsigned_long_long" not declared in "C"
azul.ads:145640:86: "unsigned_long_long" not declared in "C"
azul.ads:145646:91: "unsigned_long_long" not declared in "C"
azul.ads:145652:88: "unsigned_long_long" not declared in "C"
azul.ads:145658:88: "unsigned_long_long" not declared in "C"
azul.ads:145664:78: "unsigned_long_long" not declared in "C"
azul.ads:145670:92: "unsigned_long_long" not declared in "C"
azul.ads:145676:89: "unsigned_long_long" not declared in "C"
azul.ads:145682:74: "unsigned_long_long" not declared in "C"
azul.ads:145688:74: "unsigned_long_long" not declared in "C"
azul.ads:145694:74: "unsigned_long_long" not declared in "C"
azul.ads:145700:84: "unsigned_long_long" not declared in "C"
azul.ads:145706:87: "unsigned_long_long" not declared in "C"
gnatmake: "hello_world.adb" compilation error
+ exit 1
::endgroup::
::group::✗ algol68 [alpha] — no 'test result: ok' (see log)
----- algol68 [alpha]: no 'test result: ok' (see log) -----
+ cp /home/runner/work/azul/azul/target/codegen/azul.a68 /home/runner/work/azul/azul/examples/algol68/
+ cp /home/runner/work/azul/azul/target/release/libazul.so /home/runner/work/azul/azul/examples/algol68/
+ cd /home/runner/work/azul/azul/examples/algol68
+ a68g hello-world.a68
a68g: exiting: source/a68g.c: 3337: insufficient memory
::endgroup::
===== end failed-binding logs =====
===== language-bindings-ubuntu-scripting-x2.txt =====
Reading package lists...
Building dependency tree...
Reading state information...
Reading package lists...
Building dependency tree...
Reading state information...
Reading package lists...
Building dependency tree...
Reading state information...
The following packages will be REMOVED:
apport-symptoms bc landscape-common libintl-perl libintl-xs-perl libisns0
liblldb-13 liblldb-15 libmodule-find-perl libmodule-scandeps-perl libmspack0
libopeniscsiusr libproc-processtable-perl libsort-naturally-perl
libterm-readkey-perl libxmlsec1 libxmlsec1-openssl lxd-agent-loader
needrestart open-iscsi open-vm-tools python3-apport python3-automat
python3-bcrypt python3-click python3-colorama python3-constantly
python3-hamcrest python3-hyperlink python3-incremental
python3-problem-report python3-pyasn1 python3-pyasn1-modules
python3-service-identity python3-systemd python3-twisted
python3-zope.interface zerofree
0 upgraded, 0 newly installed, 38 to remove and 79 not upgraded.
After this operation, 62.9 MB disk space will be freed.
(Reading database ...
(Reading database ... 5%
(Reading database ... 10%
(Reading database ... 15%
(Reading database ... 20%
(Reading database ... 25%
(Reading database ... 30%
(Reading database ... 35%
(Reading database ... 40%
(Reading database ... 45%
(Reading database ... 50%
(Reading database ... 55%
(Reading database ... 60%
(Reading database ... 65%
(Reading database ... 70%
(Reading database ... 75%
(Reading database ... 80%
(Reading database ... 85%
(Reading database ... 90%
(Reading database ... 95%
(Reading database ... 100%
(Reading database ... 263219 files and directories currently installed.)
Removing apport-symptoms (0.24) ...
Removing landscape-common (23.02-0ubuntu1~22.04.7) ...
Removing bc (1.07.1-3build1) ...
Removing libintl-xs-perl (1.26-3build2) ...
Removing needrestart (3.5-5ubuntu2.5) ...
Removing libintl-perl (1.26-3build2) ...
Removing open-iscsi (2.1.5-1ubuntu1.1) ...
Warning: Stopping iscsid.service, but it can still be activated by:
iscsid.socket
Removing libisns0:amd64 (0.101-0ubuntu2) ...
Removing liblldb-13 (1:13.0.1-2ubuntu2.2) ...
Removing liblldb-15 (1:15.0.7-0ubuntu0.22.04.3) ...
Removing libmodule-find-perl (0.15-1) ...
Removing libmodule-scandeps-perl (1.31-1ubuntu0.1) ...
Removing open-vm-tools (2:12.3.5-3~ubuntu0.22.04.3) ...
Removing libmspack0:amd64 (0.10.1-2build2) ...
Removing libopeniscsiusr (2.1.5-1ubuntu1.1) ...
Removing libproc-processtable-perl:amd64 (0.634-1build1) ...
Removing libsort-naturally-perl (1.03-2) ...
Removing libterm-readkey-perl (2.38-1build4) ...
Removing libxmlsec1-openssl:amd64 (1.2.33-1build2) ...
Removing libxmlsec1:amd64 (1.2.33-1build2) ...
Removing lxd-agent-loader (0.5) ...
Removing python3-apport (2.20.11-0ubuntu82.10) ...
Removing python3-twisted (22.1.0-2ubuntu2.7) ...
Removing python3-automat (20.2.0-1) ...
Removing python3-bcrypt (3.2.0-1build1) ...
Removing python3-click (8.0.3-1) ...
Removing python3-colorama (0.4.4-1) ...
Removing python3-constantly (15.1.0-2) ...
Removing python3-hamcrest (2.0.2-2) ...
Removing python3-hyperlink (21.0.0-3) ...
Removing python3-incremental (21.3.0-1) ...
Removing python3-problem-report (2.20.11-0ubuntu82.10) ...
Removing python3-service-identity (18.1.0-6) ...
Removing python3-pyasn1-modules (0.2.1-1) ...
Removing python3-pyasn1 (0.4.8-1ubuntu0.3) ...
Removing python3-systemd (234-3ubuntu2) ...
Removing python3-zope.interface (5.4.0-1build1) ...
Removing zerofree (1.1.1-1build3) ...
Processing triggers for libc-bin (2.35-0ubuntu3.14) ...
Processing triggers for man-db (2.10.2-1) ...
Not building database; man-db/auto-update is not 'true'.
Processing triggers for install-info (6.8-4build1) ...
Processing triggers for initramfs-tools (0.140ubuntu13.5) ...
update-initramfs: Generating /boot/initrd.img-6.8.0-1064-azure
Reading package lists...
Building dependency tree...
Reading state information...
The following additional packages will be installed:
libgst7
Suggested packages:
gnu-smalltalk-doc
Recommended packages:
gnu-smalltalk-common
The following NEW packages will be installed:
gnu-smalltalk libgst7
0 upgraded, 2 newly installed, 0 to remove and 79 not upgraded.
Need to get 760 kB of archives.
After this operation, 4356 kB of additional disk space will be used.
Get:1 file:/etc/apt/apt-mirrors.txt Mirrorlist [144 B]
Get:2 http://azure.archive.ubuntu.com/ubuntu jammy/universe amd64 libgst7 amd64 3.2.5-1.3ubuntu1 [255 kB]
Get:3 http://azure.archive.ubuntu.com/ubuntu jammy/universe amd64 gnu-smalltalk amd64 3.2.5-1.3ubuntu1 [504 kB]
Fetched 760 kB in 0s (5465 kB/s)
Selecting previously unselected package libgst7.
(Reading database ...
(Reading database ... 5%
(Reading database ... 10%
(Reading database ... 15%
(Reading database ... 20%
(Reading database ... 25%
(Reading database ... 30%
(Reading database ... 35%
(Reading database ... 40%
(Reading database ... 45%
(Reading database ... 50%
(Reading database ... 55%
(Reading database ... 60%
(Reading database ... 65%
(Reading database ... 70%
(Reading database ... 75%
(Reading database ... 80%
(Reading database ... 85%
(Reading database ... 90%
(Reading database ... 95%
(Reading database ... 100%
(Reading database ... 261057 files and directories currently installed.)
Preparing to unpack .../libgst7_3.2.5-1.3ubuntu1_amd64.deb ...
Unpacking libgst7 (3.2.5-1.3ubuntu1) ...
Selecting previously unselected package gnu-smalltalk.
Preparing to unpack .../gnu-smalltalk_3.2.5-1.3ubuntu1_amd64.deb ...
Unpacking gnu-smalltalk (3.2.5-1.3ubuntu1) ...
Setting up libgst7 (3.2.5-1.3ubuntu1) ...
Setting up gnu-smalltalk (3.2.5-1.3ubuntu1) ...
Processing triggers for man-db (2.10.2-1) ...
Not building database; man-db/auto-update is not 'true'.
Processing triggers for libc-bin (2.35-0ubuntu3.14) ...
Reading package lists...
Building dependency tree...
Reading state information...
The following packages will be REMOVED:
gnu-smalltalk
0 upgraded, 0 newly installed, 1 to remove and 79 not upgraded.
After this operation, 3578 kB disk space will be freed.
(Reading database ...
(Reading database ... 5%
(Reading database ... 10%
(Reading database ... 15%
(Reading database ... 20%
(Reading database ... 25%
(Reading database ... 30%
(Reading database ... 35%
(Reading database ... 40%
(Reading database ... 45%
(Reading database ... 50%
(Reading database ... 55%
(Reading database ... 60%
(Reading database ... 65%
(Reading database ... 70%
(Reading database ... 75%
(Reading database ... 80%
(Reading database ... 85%
(Reading database ... 90%
(Reading database ... 95%
(Reading database ... 100%
(Reading database ... 261109 files and directories currently installed.)
Removing gnu-smalltalk (3.2.5-1.3ubuntu1) ...
Processing triggers for man-db (2.10.2-1) ...
Not building database; man-db/auto-update is not 'true'.
Reading package lists...
Building dependency tree...
Reading state information...
The following packages will be REMOVED:
libgst7
0 upgraded, 0 newly installed, 1 to remove and 79 not upgraded.
After this operation, 778 kB disk space will be freed.
(Reading database ...
(Reading database ... 5%
(Reading database ... 10%
(Reading database ... 15%
(Reading database ... 20%
(Reading database ... 25%
(Reading database ... 30%
(Reading database ... 35%
(Reading database ... 40%
(Reading database ... 45%
(Reading database ... 50%
(Reading database ... 55%
(Reading database ... 60%
(Reading database ... 65%
(Reading database ... 70%
(Reading database ... 75%
(Reading database ... 80%
(Reading database ... 85%
(Reading database ... 90%
(Reading database ... 95%
(Reading database ... 100%
(Reading database ... 261061 files and directories currently installed.)
Removing libgst7 (3.2.5-1.3ubuntu1) ...
Processing triggers for libc-bin (2.35-0ubuntu3.14) ...
# Azul language-binding AZ_E2E status board
Host: Linux | lib: /home/runner/work/azul/azul/target/release/libazul.so
Scenario: /home/runner/work/azul/azul/tests/e2e/hello_world_counter.json
Logs: /tmp/azul-e2e-matrix.w0C7CZ
| language | tier | status | note |
|----------|------|--------|------|
| racket | beta | ✓ WORKS | test result: ok |
| odin | beta | ✓ WORKS | test result: ok |
| powershell | alpha | ⊘ SKIP | Windows-only (macOS pwsh CFRunLoop blocks NSApp.run per README) |
| red | beta | ⊘ SKIP | redc not installed (download from red-lang.org) |
| freebasic | alpha | ⊘ SKIP | fbc not installed (x86_64 Linux/Win only; no macOS-aarch64) |
| smalltalk | alpha | ⊘ SKIP | smoke-tier OK (gst FFI init); full GUI needs Pharo + Tonel package layout (codegen does not emit it yet) per README |
| vb6 | alpha | ⊘ SKIP | 32-bit Windows legacy only (no VB6 toolchain on Linux/macOS) |
| d | beta | ✓ WORKS | test result: ok |
| crystal | beta | ✗ FAILS | compile/link error (see log) |
| v | beta | ✗ FAILS | compile/link error (see log) |
| julia | beta | ✓ WORKS | test result: ok |
| swift | beta | ✓ WORKS | test result: ok |
Tally: 5 ✓ WORKS / 2 ✗ FAILS / 5 ⊘ SKIP (of 12 languages); SHIPPED failures: 0
===== FAILED binding logs (last 80 lines each) =====
::group::✗ crystal [beta] — compile/link error (see log)
----- crystal [beta]: compile/link error (see log) -----
+ rm -rf /home/runner/work/azul/azul/examples/crystal/lib
+ mkdir -p /home/runner/work/azul/azul/examples/crystal/lib
+ cp -R /home/runner/work/azul/azul/target/codegen/crystal /home/runner/work/azul/azul/examples/crystal/lib/azul
+ cp /home/runner/work/azul/azul/target/release/libazul.so /home/runner/work/azul/azul/examples/crystal/
+ cd /home/runner/work/azul/azul/examples/crystal
+ local BIN=./hello-world-e2e
+ '[' 0 = 1 ']'
+ '[' 0 = 1 ']'
+ crystal build hello-world.cr -o hello-world-e2e --link-flags -L.
ld.lld: error: unable to find library -lazul (this usually means you need to install the development package for libazul)
collect2: error: ld returned 1 exit status
Error: execution of command failed with exit status 1: cc "${@}" -o /home/runner/work/azul/azul/examples/crystal/hello-world-e2e -L. -rdynamic -fuse-ld=lld -L/home/runner/work/_temp/crystal-latest-true-undefined/bin/../lib/crystal -lazul -lgc -lpthread -lpthread -ldl
+ exit 1
::endgroup::
::group::✗ v [beta] — compile/link error (see log)
----- v [beta]: compile/link error (see log) -----
257 | WordLeft
258 | WordRight
azul/azul.v:257:2: error: field name `WordLeft` cannot contain uppercase letters, use snake_case instead
255 | Up
256 | Down
257 | WordLeft
| ~~~~~~~~
258 | WordRight
259 | LineStart
azul/azul.v:258:2: error: field name `WordRight` cannot contain uppercase letters, use snake_case instead
256 | Down
257 | WordLeft
258 | WordRight
| ~~~~~~~~~
259 | LineStart
260 | LineEnd
azul/azul.v:259:2: error: field name `LineStart` cannot contain uppercase letters, use snake_case instead
257 | WordLeft
258 | WordRight
259 | LineStart
| ~~~~~~~~~
260 | LineEnd
261 | DocumentStart
azul/azul.v:260:2: error: field name `LineEnd` cannot contain uppercase letters, use snake_case instead
258 | WordRight
259 | LineStart
260 | LineEnd
| ~~~~~~~
261 | DocumentStart
262 | DocumentEnd
azul/azul.v:261:2: error: field name `DocumentStart` cannot contain uppercase letters, use snake_case instead
259 | LineStart
260 | LineEnd
261 | DocumentStart
| ~~~~~~~~~~~~~
262 | DocumentEnd
263 | Absolute
azul/azul.v:262:2: error: field name `DocumentEnd` cannot contain uppercase letters, use snake_case instead
260 | LineEnd
261 | DocumentStart
262 | DocumentEnd
| ~~~~~~~~~~~
263 | Absolute
264 | }
azul/azul.v:263:2: error: field name `Absolute` cannot contain uppercase letters, use snake_case instead
261 | DocumentStart
262 | DocumentEnd
263 | Absolute
| ~~~~~~~~
264 | }
265 |
azul/azul.v:267:2: error: field name `Light` cannot contain uppercase letters, use snake_case instead
265 |
266 | pub enum AzTheme as int {
267 | Light
| ~~~~~
268 | Dark
269 | }
azul/azul.v:268:2: error: field name `Dark` cannot contain uppercase letters, use snake_case instead
266 | pub enum AzTheme as int {
267 | Light
268 | Dark
| ~~~~
269 | }
270 |
azul/azul.v:272:2: error: field name `SlowFullScreen` cannot contain uppercase letters, use snake_case instead
270 |
271 | pub enum AzFullScreenMode as int {
272 | SlowFullScreen
| ~~~~~~~~~~~~~~
273 | FastFullScreen
274 | SlowWindowed
azul/azul.v:273:2: error: field name `FastFullScreen` cannot contain uppercase letters, use snake_case instead
271 | pub enum AzFullScreenMode as int {
272 | SlowFullScreen
273 | FastFullScreen
| ~~~~~~~~~~~~~~
274 | SlowWindowed
275 | FastWindowed
+ exit 1
::endgroup::
===== end failed-binding logs =====